Unconfigured Ad

Collapse
X
 
  • Time
  • Show
Clear All
new posts
  • bossy
    Junior Member
    • Nov 2013
    • 1

    #1

    stampy install error

    Hi,

    I tried to install stampy in my Ubuntu system.
    But when I use the $ make
    The error shown like this:

    make[1]: Entering directory `/home/b/bin/stampy-1.0.22'
    make[2]: Entering directory `/home/b/bin/stampy-1.0.22'
    cp -r build/python2.7/* .
    g++ `python2.7-config --ldflags` -pthread -shared -Wl build/linux-x86_64-2.7-ucs4/pyx/maptools.o build/linux-x86_64-2.7-ucs4/c/maputils.o build/linux-x86_64-2.7-ucs4/c/alignutils.o build/linux-x86_64-2.7-ucs4/readalign.o build/linux-x86_64-2.7-ucs4/algebras.o build/linux-x86_64-2.7-ucs4/frontend.o -o maptools.so
    g++: error: unrecognized command line option ‘-Wl’
    make[2]: *** [buildall] Error 1
    make[2]: Leaving directory `/home/b/bin/stampy-1.0.22'
    make[1]: *** [build-stampy] Error 2
    make[1]: Leaving directory `/home/b/bin/stampy-1.0.22'
    make: *** [all] Error 2

    Is anybody know how to fix this problem. Thx!
  • emalick
    Junior Member
    • Jan 2014
    • 1

    #2
    Any luck resolving this problem? I'm having a similar issue.

    Comment

    • darked89
      Member
      • Jun 2009
      • 38

      #3
      Originally posted by bossy View Post
      Hi,

      I tried to install stampy in my Ubuntu system.
      But when I use the $ make
      The error shown like this:

      make[1]: Entering directory `/home/b/bin/stampy-1.0.22'
      make[2]: Entering directory `/home/b/bin/stampy-1.0.22'
      cp -r build/python2.7/* .
      g++ `python2.7-config --ldflags` -pthread -shared -Wl build/linux-x86_64-2.7-ucs4/pyx/maptools.o build/linux-x86_64-2.7-ucs4/c/maputils.o build/linux-x86_64-2.7-ucs4/c/alignutils.o build/linux-x86_64-2.7-ucs4/readalign.o build/linux-x86_64-2.7-ucs4/algebras.o build/linux-x86_64-2.7-ucs4/frontend.o -o maptools.so
      g++: error: unrecognized command line option ‘-Wl’
      make[2]: *** [buildall] Error 1
      make[2]: Leaving directory `/home/b/bin/stampy-1.0.22'
      make[1]: *** [build-stampy] Error 2
      make[1]: Leaving directory `/home/b/bin/stampy-1.0.22'
      make: *** [all] Error 2

      Is anybody know how to fix this problem. Thx!

      Yes. Just run the last command without the -Wl
      Like this:

      g++ `python2.7-config --ldflags` -pthread -shared build/linux-x86_64-2.7-ucs4/pyx/maptools.o build/linux-x86_64-2.7-ucs4/c/maputils.o build/linux-x86_64-2.7-ucs4/c/alignutils.o build/linux-x86_64-2.7-ucs4/readalign.o build/linux-x86_64-2.7-ucs4/algebras.o build/linux-x86_64-2.7-ucs4/frontend.o -o maptools.so

      This is an error with newer gcc, 4.8.1 in my case. And BTW, check the neweest version:
      http://www.well.ox.ac.uk/%7Egerton/s....0.23r2059.tgz

      Hope it helps.

      Darek

      Comment

      Latest Articles

      Collapse

      • SEQadmin2
        Multiomic Liquid Biopsy: What DNA/RNA Panels Reveal That DNA Alone Can’t
        by SEQadmin2



        Tumors contain complex mixtures of cell populations that evolve in response to treatment and host-specific factors. Tissue biopsies provide only static snapshots of a tumor’s state. But what if we could follow that evolution over time using a minimally invasive technique?

        Liquid biopsies can detect tumor-derived material circulating in the bloodstream, providing a way to study treatment response, detect emerging resistance, and discover new biomarkers. Circulating
        ...
        Today, 09:55 AM
      • SEQadmin2
        New Genomics Technologies Take Aim at Long-Standing Limits
        by SEQadmin2


        Researchers using sequencing and genomics tools often have to make trade-offs. They can choose between speed or scale, short reads or long-range information, or targeted panels or a view of the whole transcriptome. New technologies that have been released this year are built to address those tough choices.

        We asked six companies the same four questions to learn about their latest products. The new technologies bring a lot to the table, including rethinking sequencing
        ...
        09-28-2026, 10:25 AM

      ad_right_rmr

      Collapse

      News

      Collapse

      Topics Statistics Last Post
      Started by SEQadmin2, Today, 05:39 AM
      0 responses
      10 views
      0 reactions
      Last Post SEQadmin2  
      Started by SEQadmin2, Yesterday, 09:56 AM
      0 responses
      12 views
      0 reactions
      Last Post SEQadmin2  
      Started by SEQadmin2, 10-09-2026, 11:14 AM
      0 responses
      25 views
      0 reactions
      Last Post SEQadmin2  
      Started by SEQadmin2, 09-29-2026, 09:51 AM
      0 responses
      77 views
      0 reactions
      Last Post SEQadmin2  
      Working...