Place this near the top of param.cpp:
Code:
#include<stdlib.h>
You are currently viewing the SEQanswers forums as a guest, which limits your access. Click here to register now, and join the discussion
g++ -DMAXGAP=3 -DMAXHITS=10000 -DTHREAD -O3 -DDB_CHR -DREAD_60 -c param.cpp -o param.chr.o g++ -DMAXGAP=3 -DMAXHITS=10000 -DTHREAD -O3 -DDB_CHR -DREAD_60 -c reads.cpp -o reads.chr.o reads.cpp: In member function ‘void ReadClass::CheckFile(std::ifstream&)’: reads.cpp:32: error: ‘exit’ was not declared in this scope reads.cpp:37: error: ‘exit’ was not declared in this scope reads.cpp:41: error: ‘exit’ was not declared in this scope make: *** [reads.chr.o] Error 1
| Topics | Statistics | Last Post | ||
|---|---|---|---|---|
|
Started by SEQadmin2, Today, 11:13 AM
|
0 responses
10 views
0 reactions
|
Last Post
by SEQadmin2
Today, 11:13 AM
|
||
|
Started by SEQadmin2, Today, 10:48 AM
|
0 responses
10 views
0 reactions
|
Last Post
by SEQadmin2
Today, 10:48 AM
|
||
|
Started by SEQadmin2, 10-15-2026, 10:52 AM
|
0 responses
32 views
0 reactions
|
Last Post
by SEQadmin2
10-15-2026, 10:52 AM
|
||
|
Started by SEQadmin2, 10-14-2026, 05:39 AM
|
0 responses
40 views
0 reactions
|
Last Post
by SEQadmin2
10-14-2026, 05:39 AM
|
Comment