Unconfigured Ad

Collapse
X
 
  • Time
  • Show
Clear All
new posts
  • BabyFaruda
    Member
    • May 2014
    • 11

    #1

    ABYSS pe error

    Hello, I got this error message from ABYSS -pe

    error: removing `contigs-0.fa': No such file or directory

    What should I do to make it works?

    Thank you.
  • westerman
    Rick Westerman
    • Jun 2008
    • 1104

    #2
    Give us more information on how you are running ABySS. This is not a common error.

    Comment

    • BabyFaruda
      Member
      • May 2014
      • 11

      #3
      This is the command that I used:

      /abyss-pe np=50 name=testtest k=45 in='./Hiseq/PE1P.fastq ./Hiseq/PE2P.fastq'



      This is how the end of the logfile looks like:


      Assembled 355161061 k-mer in 7443983 contigs.
      Concatenating fasta files to testtest-1.fa
      Concatenating fasta files to testtest-1.fa
      0: Assembled 355161061 k-mer in 7443983 contigs.
      Assembled 355161061 k-mer in 7443983 contigs.
      Concatenating fasta files to testtest-1.fa
      0: Assembled 355161061 k-mer in 7443983 contigs.
      Assembled 355161061 k-mer in 7443983 contigs.
      Concatenating fasta files to testtest-1.fa
      0: Assembled 355161061 k-mer in 7443983 contigs.
      Assembled 355161061 k-mer in 7443983 contigs.
      Concatenating fasta files to testtest-1.fa
      0: Assembled 355161061 k-mer in 7443983 contigs.
      Assembled 355161061 k-mer in 7443983 contigs.
      Concatenating fasta files to testtest-1.fa
      0: Assembled 355161061 k-mer in 7443983 contigs.
      Assembled 355161061 k-mer in 7443983 contigs.
      0: Assembled 355161061 k-mer in 7443983 contigs.
      Assembled 355161061 k-mer in 7443983 contigs.
      Concatenating fasta files to testtest-1.fa
      0: Assembled 355161061 k-mer in 7443983 contigs.
      Assembled 355161061 k-mer in 7443983 contigs.
      Concatenating fasta files to testtest-1.fa
      Concatenating fasta files to testtest-1.fa
      0: Assembled 355161061 k-mer in 7443983 contigs.
      Assembled 355161061 k-mer in 7443983 contigs.
      Concatenating fasta files to testtest-1.fa
      0: Assembled 355161061 k-mer in 7443983 contigs.
      Assembled 355161061 k-mer in 7443983 contigs.
      0: Assembled 355161061 k-mer in 7443983 contigs.
      Assembled 355161061 k-mer in 7443983 contigs.
      Concatenating fasta files to testtest-1.fa
      0: Assembled 355161061 k-mer in 7443983 contigs.
      Assembled 355161061 k-mer in 7443983 contigs.
      Concatenating fasta files to testtest-1.fa
      Concatenating fasta files to testtest-1.fa
      0: Assembled 355161061 k-mer in 7443983 contigs.
      Assembled 355161061 k-mer in 7443983 contigs.
      Concatenating fasta files to testtest-1.fa
      Concatenating fasta files to testtest-1.fa
      Concatenating fasta files to testtest-bubbles.fa
      Done.
      error: removing `contigs-0.fa': No such file or directory
      error: removing `contigs-0.fa': No such file or directory
      error: removing `contigs-0.fa': No such file or directory
      error: removing `contigs-0.fa': No such file or directory
      error: removing `contigs-0.fa': No such file or directory
      error: removing `contigs-0.fa': No such file or directory
      error: removing `contigs-0.fa': No such file or directory
      error: removing `contigs-0.fa': No such file or directory
      error: removing `contigs-0.fa': No such file or directory
      error: removing `contigs-0.fa': No such file or directory
      error: removing `contigs-0.fa': No such file or directory
      error: removing `contigs-0.fa': No such file or directory
      error: removing `contigs-0.fa': No such file or directory
      error: removing `contigs-0.fa': No such file or directory
      error: removing `contigs-0.fa': No such file or directory
      error: removing `contigs-0.fa': No such file or directory
      error: removing `contigs-0.fa': No such file or directory
      error: removing `contigs-0.fa': No such file or directory
      error: removing `contigs-0.fa': No such file or directory
      error: removing `contigs-0.fa': No such file or directory
      error: removing `contigs-0.fa': No such file or directory
      error: removing `contigs-0.fa': No such file or directory
      error: removing `contigs-0.fa': No such file or directory
      error: removing `contigs-0.fa': No such file or directory
      error: removing `contigs-0.fa': No such file or directory
      error: removing `contigs-0.fa': No such file or directory
      error: removing `contigs-0.fa': No such file or directory
      error: removing `contigs-0.fa': No such file or directory
      error: removing `contigs-0.fa': No such file or directory
      error: removing `contigs-0.fa': No such file or directory
      error: removing `contigs-0.fa': No such file or directory
      error: removing `contigs-0.fa': No such file or directory
      error: removing `contigs-0.fa': No such file or directory
      error: removing `contigs-0.fa': No such file or directory
      error: removing `contigs-0.fa': No such file or directory
      error: removing `contigs-0.fa': No such file or directory
      error: removing `contigs-0.fa': No such file or directory
      error: removing `contigs-0.fa': No such file or directory
      error: removing `contigs-0.fa': No such file or directory

      ===================================================================================
      = BAD TERMINATION OF ONE OF YOUR APPLICATION PROCESSES
      = PID 62249 RUNNING AT gntcs-alit-hp1
      = EXIT CODE: 9
      = CLEANING UP REMAINING PROCESSES
      = YOU CAN IGNORE THE BELOW CLEANUP MESSAGES
      ===================================================================================
      YOUR APPLICATION TERMINATED WITH THE EXIT STRING: Terminated (signal 15)
      This typically refers to a problem with your application.
      Please see the FAQ page for debugging suggestions
      make: *** [testtest-1.fa] Error 15
      -bash-4.1$

      Comment

      • BabyFaruda
        Member
        • May 2014
        • 11

        #4
        This is the command I used:

        /abyss-pe np=50 name=testtest k=45 in='./Hiseq/PE1P.fastq ./Hise/abyss-pe np=50 name=testtest k=45 in='./Hiseq/PE1P.fastq ./Hiseq/PE2P.fastq'q/PE2P.fastq'


        This is the tail of the logfile:
        Concatenating fasta files to testtest-1.fa
        Concatenating fasta files to testtest-1.fa
        0: Assembled 355161061 k-mer in 7443983 contigs.
        Assembled 355161061 k-mer in 7443983 contigs.
        Concatenating fasta files to testtest-1.fa
        Concatenating fasta files to testtest-1.fa
        Concatenating fasta files to testtest-bubbles.fa
        Done.
        error: removing `contigs-0.fa': No such file or directory
        error: removing `contigs-0.fa': No such file or directory
        error: removing `contigs-0.fa': No such file or directory
        error: removing `contigs-0.fa': No such file or directory
        error: removing `contigs-0.fa': No such file or directory
        error: removing `contigs-0.fa': No such file or directory
        error: removing `contigs-0.fa': No such file or directory
        error: removing `contigs-0.fa': No such file or directory
        error: removing `contigs-0.fa': No such file or directory
        error: removing `contigs-0.fa': No such file or directory
        error: removing `contigs-0.fa': No such file or directory
        error: removing `contigs-0.fa': No such file or directory
        error: removing `contigs-0.fa': No such file or directory
        error: removing `contigs-0.fa': No such file or directory
        error: removing `contigs-0.fa': No such file or directory
        error: removing `contigs-0.fa': No such file or directory
        error: removing `contigs-0.fa': No such file or directory
        error: removing `contigs-0.fa': No such file or directory
        error: removing `contigs-0.fa': No such file or directory
        error: removing `contigs-0.fa': No such file or directory
        error: removing `contigs-0.fa': No such file or directory
        error: removing `contigs-0.fa': No such file or directory
        error: removing `contigs-0.fa': No such file or directory
        error: removing `contigs-0.fa': No such file or directory
        error: removing `contigs-0.fa': No such file or directory
        error: removing `contigs-0.fa': No such file or directory
        error: removing `contigs-0.fa': No such file or directory
        error: removing `contigs-0.fa': No such file or directory
        error: removing `contigs-0.fa': No such file or directory
        error: removing `contigs-0.fa': No such file or directory
        error: removing `contigs-0.fa': No such file or directory
        error: removing `contigs-0.fa': No such file or directory
        error: removing `contigs-0.fa': No such file or directory
        error: removing `contigs-0.fa': No such file or directory
        error: removing `contigs-0.fa': No such file or directory
        error: removing `contigs-0.fa': No such file or directory
        error: removing `contigs-0.fa': No such file or directory
        error: removing `contigs-0.fa': No such file or directory
        error: removing `contigs-0.fa': No such file or directory

        ===================================================================================
        = BAD TERMINATION OF ONE OF YOUR APPLICATION PROCESSES
        = PID 62249 RUNNING AT gntcs-alit-hp1
        = EXIT CODE: 9
        = CLEANING UP REMAINING PROCESSES
        = YOU CAN IGNORE THE BELOW CLEANUP MESSAGES
        ===================================================================================
        YOUR APPLICATION TERMINATED WITH THE EXIT STRING: Terminated (signal 15)
        This typically refers to a problem with your application.
        Please see the FAQ page for debugging suggestions
        make: *** [testtest-1.fa] Error 15
        -bash-4.1$

        Comment

        • BabyFaruda
          Member
          • May 2014
          • 11

          #5
          I ran it remotely using this command

          /abyss-pe np=50 name=testtest k=45 in='./Hiseq/PE1P.fastq ./Hise/abyss-pe np=50 name=testtest k=45 in='./Hiseq/PE1P.fastq ./Hiseq/PE2P.fastq'q/PE2P.fastq'

          This is the tail of the log file

          Concatenating fasta files to testtest-1.fa
          Concatenating fasta files to testtest-1.fa
          0: Assembled 355161061 k-mer in 7443983 contigs.
          Assembled 355161061 k-mer in 7443983 contigs.
          Concatenating fasta files to testtest-1.fa
          Concatenating fasta files to testtest-1.fa
          Concatenating fasta files to testtest-bubbles.fa
          Done.
          error: removing `contigs-0.fa': No such file or directory
          error: removing `contigs-0.fa': No such file or directory
          error: removing `contigs-0.fa': No such file or directory
          error: removing `contigs-0.fa': No such file or directory
          error: removing `contigs-0.fa': No such file or directory
          error: removing `contigs-0.fa': No such file or directory
          error: removing `contigs-0.fa': No such file or directory
          error: removing `contigs-0.fa': No such file or directory
          error: removing `contigs-0.fa': No such file or directory
          error: removing `contigs-0.fa': No such file or directory
          error: removing `contigs-0.fa': No such file or directory
          error: removing `contigs-0.fa': No such file or directory
          error: removing `contigs-0.fa': No such file or directory
          error: removing `contigs-0.fa': No such file or directory
          error: removing `contigs-0.fa': No such file or directory
          error: removing `contigs-0.fa': No such file or directory
          error: removing `contigs-0.fa': No such file or directory
          error: removing `contigs-0.fa': No such file or directory
          error: removing `contigs-0.fa': No such file or directory
          error: removing `contigs-0.fa': No such file or directory
          error: removing `contigs-0.fa': No such file or directory
          error: removing `contigs-0.fa': No such file or directory
          error: removing `contigs-0.fa': No such file or directory
          error: removing `contigs-0.fa': No such file or directory
          error: removing `contigs-0.fa': No such file or directory
          error: removing `contigs-0.fa': No such file or directory
          error: removing `contigs-0.fa': No such file or directory
          error: removing `contigs-0.fa': No such file or directory
          error: removing `contigs-0.fa': No such file or directory
          error: removing `contigs-0.fa': No such file or directory
          error: removing `contigs-0.fa': No such file or directory
          error: removing `contigs-0.fa': No such file or directory
          error: removing `contigs-0.fa': No such file or directory
          error: removing `contigs-0.fa': No such file or directory
          error: removing `contigs-0.fa': No such file or directory
          error: removing `contigs-0.fa': No such file or directory
          error: removing `contigs-0.fa': No such file or directory
          error: removing `contigs-0.fa': No such file or directory
          error: removing `contigs-0.fa': No such file or directory

          ===================================================================================
          = BAD TERMINATION OF ONE OF YOUR APPLICATION PROCESSES
          = PID 62249 RUNNING AT gntcs-alit-hp1
          = EXIT CODE: 9
          = CLEANING UP REMAINING PROCESSES
          = YOU CAN IGNORE THE BELOW CLEANUP MESSAGES
          ===================================================================================
          YOUR APPLICATION TERMINATED WITH THE EXIT STRING: Terminated (signal 15)
          This typically refers to a problem with your application.
          Please see the FAQ page for debugging suggestions
          make: *** [testtest-1.fa] Error 15
          -bash-4.1$

          Comment

          Latest Articles

          Collapse

          • SEQadmin2
            Multiomic Liquid Biopsy: What DNA/RNA Panels Reveal That DNA Alone Can’t
            by SEQadmin2



            Tumors contain complex mixtures of cell populations that evolve in response to treatment and host-specific factors. Tissue biopsies provide only static snapshots of a tumor’s state. But what if we could follow that evolution over time using a minimally invasive technique?

            Liquid biopsies can detect tumor-derived material circulating in the bloodstream, providing a way to study treatment response, detect emerging resistance, and discover new biomarkers. Circulating
            ...
            10-14-2026, 09:55 AM
          • SEQadmin2
            New Genomics Technologies Take Aim at Long-Standing Limits
            by SEQadmin2


            Researchers using sequencing and genomics tools often have to make trade-offs. They can choose between speed or scale, short reads or long-range information, or targeted panels or a view of the whole transcriptome. New technologies that have been released this year are built to address those tough choices.

            We asked six companies the same four questions to learn about their latest products. The new technologies bring a lot to the table, including rethinking sequencing
            ...
            09-28-2026, 10:25 AM

          ad_right_rmr

          Collapse

          News

          Collapse

          Topics Statistics Last Post
          Started by SEQadmin2, 10-22-2026, 11:13 AM
          0 responses
          52 views
          0 reactions
          Last Post SEQadmin2  
          Started by SEQadmin2, 10-22-2026, 10:48 AM
          0 responses
          39 views
          0 reactions
          Last Post SEQadmin2  
          Started by SEQadmin2, 10-15-2026, 10:52 AM
          0 responses
          46 views
          0 reactions
          Last Post SEQadmin2  
          Started by SEQadmin2, 10-14-2026, 05:39 AM
          0 responses
          46 views
          0 reactions
          Last Post SEQadmin2  
          Working...