Unconfigured Ad

Collapse
X
 
  • Time
  • Show
Clear All
new posts
  • nilshomer
    Nils Homer
    • Nov 2008
    • 1283

    #16
    Originally posted by Krosh View Post
    Hi,
    I can't install bfast in Ubuntu. Thanks for any help.
    Same answer, install the necessary packages listed above. I am adding this to the new BFAST FAQ: https://sourceforge.net/apps/mediawi....php?title=FAQ

    Comment

    • Krosh
      Junior Member
      • Feb 2011
      • 8

      #17
      Thank you!

      Comment

      • hkg
        Junior Member
        • Sep 2011
        • 9

        #18
        Hi,

        I am also having some problems building bfast (0.7.0a) on mac osx 10.8.5 with xcode version 3.2.6.

        I am able to run the autogen.sh and ./configure successfully, but I get the following error during the make:

        Undefined symbols for architecture x86_64:
        "_AlignNTSpaceFillInCell", referenced from:
        _AlignNTSpaceGappedBounded in AlignNTSpace.o
        _AlignNTSpaceGappedConstrained in AlignNTSpace.o
        "_ScoringMatrixGetColorScore", referenced from:
        _AlignExact in Align.o
        _AlignColorSpaceUngappedGetBest in AlignColorSpace.o
        _AlignColorSpaceFillInCell in AlignColorSpace.o
        _AlignColorSpaceGappedConstrained in AlignColorSpace.o
        "_ScoringMatrixGetNTScore", referenced from:
        _AlignExact in Align.o
        _AlignNTSpaceUngapped in AlignNTSpace.o
        _AlignNTSpaceGappedConstrained in AlignNTSpace.o
        _AlignColorSpaceUngappedGetBest in AlignColorSpace.o
        _AlignColorSpaceFillInCell in AlignColorSpace.o
        _AlignColorSpaceGappedConstrained in AlignColorSpace.o
        "_ToUpper", referenced from:
        _AlignedReadConvertPrintAlignedEntryToCIGAR in AlignedReadConvert.o
        _RGBinaryRead in RGBinary.o
        _RGMatchCheck in RGMatch.o
        _AlignExact in Align.o
        (maybe you meant: _ToUpperRead)
        ld: symbol(s) not found for architecture x86_64
        clang: error: linker command failed with exit code 1 (use -v to see invocation)
        make[2]: *** [bfast] Error 1
        make[1]: *** [all-recursive] Error 1
        make: *** [all] Error 2

        Searching online leads me to believe that it is a problem in the linking stage, but I don't know how to fix it myself. If anyone has any tips for me, or if I need to post more information, then please let me know.

        Comment

        Latest Articles

        Collapse

        • SEQadmin2
          Multiomic Liquid Biopsy: What DNA/RNA Panels Reveal That DNA Alone Can’t
          by SEQadmin2



          Tumors contain complex mixtures of cell populations that evolve in response to treatment and host-specific factors. Tissue biopsies provide only static snapshots of a tumor’s state. But what if we could follow that evolution over time using a minimally invasive technique?

          Liquid biopsies can detect tumor-derived material circulating in the bloodstream, providing a way to study treatment response, detect emerging resistance, and discover new biomarkers. Circulating
          ...
          10-14-2026, 09:55 AM
        • SEQadmin2
          New Genomics Technologies Take Aim at Long-Standing Limits
          by SEQadmin2


          Researchers using sequencing and genomics tools often have to make trade-offs. They can choose between speed or scale, short reads or long-range information, or targeted panels or a view of the whole transcriptome. New technologies that have been released this year are built to address those tough choices.

          We asked six companies the same four questions to learn about their latest products. The new technologies bring a lot to the table, including rethinking sequencing
          ...
          09-28-2026, 10:25 AM

        ad_right_rmr

        Collapse

        News

        Collapse

        Topics Statistics Last Post
        Started by SEQadmin2, 10-22-2026, 11:13 AM
        0 responses
        23 views
        0 reactions
        Last Post SEQadmin2  
        Started by SEQadmin2, 10-22-2026, 10:48 AM
        0 responses
        20 views
        0 reactions
        Last Post SEQadmin2  
        Started by SEQadmin2, 10-15-2026, 10:52 AM
        0 responses
        36 views
        0 reactions
        Last Post SEQadmin2  
        Started by SEQadmin2, 10-14-2026, 05:39 AM
        0 responses
        42 views
        0 reactions
        Last Post SEQadmin2  
        Working...